Bitcoin full node and query server

Aug 14, 2019

View in context in the libbitcoin Slack #general mirror.

N
narodnik20:20
Anybody know what this error is about?
/usr/bin/ld: test/unicode/libbitcoin_system_test-unicode.o: in function `boost::test_tools::assertion_result boost::test_tools::tt_detail::equal_impl_frwd::call_impl<wchar_t const*, wchar_t const*>(wchar_t const* const&, wchar_t const* const&, mpl_::bool_<false>) const':
/usr/include/boost/test/tools/old/impl.hpp:130: undefined reference to `boost::test_tools::tt_detail::equal_impl(wchar_t const*, wchar_t const*)'
/usr/bin/ld: /usr/include/boost/test/tools/old/impl.hpp:130: undefined reference to `boost::test_tools::tt_detail::equal_impl(wchar_t const*, wchar_t const*)'
/usr/bin/ld: /usr/include/boost/test/tools/old/impl.hpp:130: undefined reference to `boost::test_tools::tt_detail::equal_impl(wchar_t const*, wchar_t const*)'
/usr/bin/ld: /usr/include/boost/test/tools/old/impl.hpp:130: undefined reference to `boost::test_tools::tt_detail::equal_impl(wchar_t const*, wchar_t const*)'
/usr/bin/ld: /usr/include/boost/test/tools/old/impl.hpp:130: undefined reference to `boost::test_tools::tt_detail::equal_impl(wchar_t const*, wchar_t const*)'
/usr/bin/ld: test/unicode/libbitcoin_system_test-unicode.o:/usr/include/boost/test/tools/old/impl.hpp:130: more undefined references to `boost::test_tools::tt_detail::equal_impl(wchar_t const*, wchar_t const*)' follow
collect2: error: ld returned 1 exit status
distcc[1895] ERROR: compile (null) on localhost failed
make[1]: *** [Makefile:3084: test/libbitcoin-system-test] Error 1
make[1]: Leaving directory '/home/aa/src/libbitcoin-system'
make: *** [Makefile:7060: check-am] Error 2