View in context in the libbitcoin Slack #general mirror.
~/libbitcoin/master/source ~/libbitcoin ********************** Configuration ********************** BUILD_boost : yes BUILD_secp256k1 : BUILD_ultrafast : yes BUILD_SRC_DIR : /home/neillm/libbitcoin/master/source BUILD_OBJ_DIR : /home/neillm/libbitcoin/master/source/obj BUILD_OBJ_DIR_RELATIVE : BUILD_CONFIG : release BUILD_LINK : static BUILD_FULL_REPOSITORIES : BUILD_POST_INSTALL_CLEAN : BUILD_USE_LOCAL_SRC : yes BUILD_SKIP_TESTS : yes PARALLEL : 96 PREFIX : /home/neillm/libbitcoin/master/install DISPLAY_VERBOSE : CONFIGURE_OPTIONS : --with-ultrafast --without-tests --prefix=/home/neillm/libbitcoin/master/install --enable-ndebug ********************** Toolchain Configuration Parameters ********************** CC : gcc CFLAGS : -O3 CXX : g++ CXXFLAGS : -O3 LD_RUN_PATH : /home/neillm/libbitcoin/master/install/lib LD_LIBRARY_PATH : :/usr/local/cuda-13.3/lib64:/usr/local/cuda-13.3/lib64:/home/neillm/libbitcoin/master/install/lib PKG_CONFIG_PATH : /home/neillm/libbitcoin/master/install/lib/pkgconfig:/home/neillm/libbitcoin/master/install/lib/pkgconfig LDLIBS : BOOST_ROOT : /home/neillm/libbitcoin/master/install CMAKE_PREFIX_PATH : CMAKE_INSTALL_PREFIX : /home/neillm/libbitcoin/master/install CMAKE_INCLUDE_PATH : CMAKE_LIBRARY_PATH : ********************** Preparing to acquire boost ********************** [0;93mReusing existing 'boost' directory...[0m ********************** Preparing to build boost **********************full file
In file included from /home/neillm/libbitcoin/master/source/libbitcoin-server/builds/gnu/UltrafastSecp256k1/src/opencl/tests/test_opencl.cpp:9:
/home/neillm/libbitcoin/master/source/libbitcoin-server/builds/gnu/UltrafastSecp256k1/src/opencl/include/secp256k1_opencl.hpp:18:10: fatal error: secp256k1/types.hpp: No such file or directory
18 | #include "secp256k1/types.hpp"
| ^~~~~~~~~~~~~~~~~~~~~
compilation terminated.
gmake[2]: *** [src/opencl/CMakeFiles/opencl_test.dir/build.make:79: src/opencl/CMakeFiles/opencl_test.dir/tests/test_opencl.cpp.o] Error 1
gmake[1]: *** [CMakeFiles/Makefile2:1010: src/opencl/CMakeFiles/opencl_test.dir/all] Error 2
gmake[1]: *** Waiting for unfinished jobs....